Reaction Details
TargetPlatelet-derived growth factor receptor beta
LigandBDBM50318182
Substrate/Competitorn/a
Meas. Tech.ChEMBL_793574 (CHEMBL1932342)
IC50>50000±n/a nM
Citation Gangjee, AKurup, SIhnat, MAThorpe, JEDisch, B N¿?¿-Aryl-6-substitutedphenylmethyl-7H-pyrrolo[2,3-d]pyrimidine-2,4-diamines as receptor tyrosine kinase inhibitors. Bioorg Med Chem20:910-4 (2012) 
 
Platelet-derived growth factor receptor beta
Name:Platelet-derived growth factor receptor beta
Type:Enzyme
Mol. Mass.:123922.25
Organism:Homo sapiens (Human)
Description:P09619
Residue:1106
BDBM50318182
NameBDBM50318182
Synonyms:CHEMBL1095464 | N4-(3-bromophenyl)-6-(2-methylbenzyl)-7H-pyrrolo[2,3-d]pyrimidine-2,4-diamine
TypeSmall organic molecule
Emp. Form.C20H18BrN5
Mol. Mass.408.294
SMILESCc1ccccc1Cc1cc2c(Nc3cccc(Br)c3)nc(N)nc2[nH]1