Reaction Details
TargetPlatelet-derived growth factor receptor beta
LigandBDBM50318183
Substrate/Competitorn/a
Meas. Tech.ChEMBL_793574 (CHEMBL1932342)
IC50>300000±n/a nM
Citation Gangjee, AKurup, SIhnat, MAThorpe, JEDisch, B N¿?¿-Aryl-6-substitutedphenylmethyl-7H-pyrrolo[2,3-d]pyrimidine-2,4-diamines as receptor tyrosine kinase inhibitors. Bioorg Med Chem20:910-4 (2012) 
 
Platelet-derived growth factor receptor beta
Name:Platelet-derived growth factor receptor beta
Type:Enzyme
Mol. Mass.:123922.25
Organism:Homo sapiens (Human)
Description:P09619
Residue:1106
BDBM50318183
NameBDBM50318183
Synonyms:CHEMBL1095465 | N4-(3-bromophenyl)-6-(2,5-dimethoxybenzyl)-7H-pyrrolo[2,3-d]pyrimidine-2,4-diamine
TypeSmall organic molecule
Emp. Form.C21H20BrN5O2
Mol. Mass.454.32
SMILESCOc1ccc(OC)c(Cc2cc3c(Nc4cccc(Br)c4)nc(N)nc3[nH]2)c1