Reaction Details
TargetAromatase
LigandBDBM31768
Substrate/Competitorn/a
Meas. Tech.ChEMBL_795893 (CHEMBL1936457)
Ki 398±n/a nM
Citation McNulty, JNair, JJVurgun, NDifrancesco, BRBrown, CETsoi, BCrankshaw, DJHolloway, AC Discovery of a novel class of aldol-derived 1,2,3-triazoles: potent and selective inhibitors of human cytochrome P450 19A1 (aromatase). Bioorg Med Chem Lett22:718-22 (2011) 
 
Aromatase
Name:Aromatase
Type:Enzyme
Mol. Mass.:57888.92
Organism:Homo sapiens (Human)
Description:P11511
Residue:503
BDBM31768
NameBDBM31768
Synonyms:CHEMBL295698 Nizoral | Panfungol
TypeSmall organic molecule
Emp. Form.C26H28Cl2N4O4
Mol. Mass.531.431
SMILESCC(=O)N1CCN(CC1)c1ccc(OC[C@@H]2CO[C@](Cn3ccnc3)(O2)c2ccc(Cl)cc2Cl)cc1