Reaction Details
TargetEnoyl-acyl-carrier protein reductase
LigandBDBM8726
Substrate/Competitorn/a
Meas. Tech.ChEMBL_795989 (CHEMBL1936261)
IC50 70±n/a nM
Citation Muhammad, AAnis, IAli, ZAwadelkarim, SKhan, AKhalid, AShah, MRGalal, MKhan, IAIqbal Choudhary, M Methylenebissantin: a rare methylene-bridged bisflavonoid from Dodonaea viscosa which inhibits Plasmodium falciparum enoyl-ACP reductase. Bioorg Med Chem Lett22:610-2 (2011) 
 
Enoyl-acyl-carrier protein reductase
Name:Enoyl-acyl-carrier protein reductase
Synonyms:n/a
Type:PROTEIN
Mol. Mass.:49770.86
Organism:Plasmodium falciparum
Description:ChEMBL_795989
Residue:432
BDBM8726
NameBDBM8726
TypeSmall organic molecule
Emp. Form.C12H7Cl3O2
Mol. Mass.289.542
SMILESOc1cc(Cl)ccc1Oc1ccc(Cl)cc1Cl