Reaction Details
TargetBotulinum neurotoxin type B
LigandBDBM50360392
Substrate/Competitorn/a
Meas. Tech.ChEMBL_795995 (CHEMBL1936267)
IC50>100000±n/a nM
Citation Li, BCardinale, SCButler, MMPai, RNuss, JEPeet, NPBavari, SBowlin, TL Time-dependent botulinum neurotoxin serotype A metalloprotease inhibitors. Bioorg Med Chem19:7338-48 (2011) 
 
Botulinum neurotoxin type B
Name:Botulinum neurotoxin type B
Type:PROTEIN
Mol. Mass.:150779.03
Organism:Clostridium botulinum
Description:ChEMBL_795995
Residue:1291
BDBM50360392
NameBDBM50360392
Synonyms:CHEMBL1933865
TypeSmall organic molecule
Emp. Form.C17H12IN3O
Mol. Mass.401.2012
SMILESCOc1ccc(\C=C(/C#N)c2nc3ccccc3[nH]2)cc1I