Reaction Details
TargetHemagglutinin
LigandBDBM50360451
Substrate/Competitorn/a
Meas. Tech.ChEMBL_795514 (CHEMBL1935837)
IC50>250000±n/a nM
Citation Suzuki, KKoyama, TYingsakmongkon, SSuzuki, YHatano, KMatsuoka, K Synthesis and biological evaluation of sialic acid derivatives containing a long hydrophobic chain at the anomeric position and their C-5 linked polymers as potent influenza virus inhibitors. Bioorg Med Chem20:446-54 (2011) 
 
Hemagglutinin
Name:Hemagglutinin
Type:PROTEIN
Mol. Mass.:63355.67
Organism:Influenza A virus (strain A/Puerto Rico/8/1934 H1N1)
Description:ChEMBL_795514
Residue:565
BDBM50360451
NameBDBM50360451
Synonyms:CHEMBL1934619
TypeSmall organic molecule
Emp. Form.C12H19NO9
Mol. Mass.321.2806
SMILESOC[C@@H](O)[C@@H](O)[C@@H]1OC(O)(C[C@H](O)[C@H]1NC(=O)C=C)C(O)=O