Reaction Details
TargetNeuraminidase
LigandBDBM50360451
Substrate/Competitorn/a
Meas. Tech.ChEMBL_795431 (CHEMBL1937380)
EC50 2481000±n/a nM
Citation Suzuki, KKoyama, TYingsakmongkon, SSuzuki, YHatano, KMatsuoka, K Synthesis and biological evaluation of sialic acid derivatives containing a long hydrophobic chain at the anomeric position and their C-5 linked polymers as potent influenza virus inhibitors. Bioorg Med Chem20:446-54 (2011) 
 
Neuraminidase
Name:Neuraminidase
Type:Enzyme
Mol. Mass.:50124.14
Organism:Influenza A virus (A/Puerto Rico/8/34/Mount Sinai(H1N1))
Description:P03468
Residue:454
BDBM50360451
NameBDBM50360451
Synonyms:CHEMBL1934619
TypeSmall organic molecule
Emp. Form.C12H19NO9
Mol. Mass.321.2806
SMILESOC[C@@H](O)[C@@H](O)[C@@H]1OC(O)(C[C@H](O)[C@H]1NC(=O)C=C)C(O)=O