Reaction Details
TargetNeuraminidase
LigandBDBM50360450
Substrate/Competitorn/a
Meas. Tech.ChEMBL_795432 (CHEMBL1937381)
EC50 428020±n/a nM
Citation Suzuki, KKoyama, TYingsakmongkon, SSuzuki, YHatano, KMatsuoka, K Synthesis and biological evaluation of sialic acid derivatives containing a long hydrophobic chain at the anomeric position and their C-5 linked polymers as potent influenza virus inhibitors. Bioorg Med Chem20:446-54 (2011) 
 
Neuraminidase
Name:Neuraminidase
Type:PROTEIN
Mol. Mass.:52187.20
Organism:Influenza A virus (strain A/Aichi/2/1968 H3N2)
Description:ChEMBL_679996
Residue:469
BDBM50360450
NameBDBM50360450
Synonyms:CHEMBL1934618
TypeSmall organic molecule
Emp. Form.C24H43NO8S
Mol. Mass.505.665
SMILESCCCCCCCCCCCCS[C@@]1(C[C@H](O)[C@@H](NC(=O)C=C)[C@@H](O1)[C@H](O)[C@H](O)CO)C(O)=O