Reaction Details
TargetGlucagon receptor
LigandBDBM50360596
Substrate/Competitorn/a
Meas. Tech.ChEMBL_795440 (CHEMBL1937445)
Ki 1450±n/a nM
Citation Filipski, KJBian, JEbner, DCLee, ECLi, JCSammons, MFWright, SWStevens, BDDidiuk, MTTu, MPerreault, CBrown, JAtkinson, KTan, BSalatto, CTLitchfield, JPfefferkorn, JAGuzman-Perez, A A novel series of glucagon receptor antagonists with reduced molecular weight and lipophilicity. Bioorg Med Chem Lett22:415-20 (2011) 
 
Glucagon receptor
Name:Glucagon receptor
Type:Enzyme
Mol. Mass.:54026.92
Organism:Homo sapiens (Human)
Description:P47871
Residue:477
BDBM50360596
NameBDBM50360596
Synonyms:CHEMBL1933362
TypeSmall organic molecule
Emp. Form.C23H23F3N4O4
Mol. Mass.476.4483
SMILESCCCC(Oc1cnn(c1)-c1ccc(nc1)C(F)(F)F)c1ccc(cc1)C(=O)NCCC(O)=O