Reaction Details
TargetProstaglandin D2 receptor
LigandBDBM50302828
Substrate/Competitorn/a
Meas. Tech.ChEMBL_795752 (CHEMBL1936639)
IC50 280±n/a nM
Citation Wang, YFu, ZSchmitt, MWang, XShen, WRickel, EMartin, TBudelsky, AMarshall, DCollins, TTang, HLMedina, JCLiu, JJ Optimization of phenylacetic acid derivatives for CRTH2 and DP selective antagonism. Bioorg Med Chem Lett22:367-70 (2011) 
 
Prostaglandin D2 receptor
Name:Prostaglandin D2 receptor
Type:Enzyme
Mol. Mass.:40288.87
Organism:Homo sapiens (Human)
Description:Q13258
Residue:359
BDBM50302828
NameBDBM50302828
Synonyms:2-(4-(4-(butylcarbamoyl)-2-(2,4-dichlorophenylsulfonamido)phenoxy)-3-methoxyphenyl)acetic acid | CHEMBL589973
TypeSmall organic molecule
Emp. Form.C26H26Cl2N2O7S
Mol. Mass.581.465
SMILESCCCCNC(=O)c1ccc(Oc2ccc(CC(O)=O)cc2OC)c(NS(=O)(=O)c2ccc(Cl)cc2Cl)c1