Reaction Details
Target17-beta-hydroxysteroid dehydrogenase type 3
LigandBDBM50360767
Substrate/Competitorn/a
Meas. Tech.ChEMBL_796575 (CHEMBL1937890)
IC50 40±n/a nM
Citation Harada, KKubo, HTanaka, ANishioka, K Identification of oxazolidinediones and thiazolidinediones as potent 17ß-hydroxysteroid dehydrogenase type 3 inhibitors. Bioorg Med Chem Lett22:504-7 (2011) 
 
17-beta-hydroxysteroid dehydrogenase type 3
Name:17-beta-hydroxysteroid dehydrogenase type 3
Type:PROTEIN
Mol. Mass.:34345.90
Organism:Mus musculus
Description:ChEMBL_796575
Residue:305
BDBM50360767
NameBDBM50360767
Synonyms:CHEMBL1934493
TypeSmall organic molecule
Emp. Form.C17H12BrNO3S2
Mol. Mass.422.316
SMILESCOc1ccc(cc1)N1C(=S)S\C(=C/c2ccc(O)c(Br)c2)C1=O