Reaction Details
TargetProstaglandin E synthase
LigandBDBM50360825
Substrate/Competitorn/a
Meas. Tech.ChEMBL_796762 (CHEMBL1938077)
IC50 6264±n/a nM
Citation Shiro, TTakahashi, HKakiguchi, KInoue, YMasuda, KNagata, HTobe, M Synthesis and SAR study of imidazoquinolines as a novel structural class of microsomal prostaglandin E2 synthase-1 inhibitors. Bioorg Med Chem Lett22:285-8 (2011) 
 
Prostaglandin E synthase
Name:Prostaglandin E synthase
Type:Protein
Mol. Mass.:17112.22
Organism:Homo sapiens (Human)
Description:n/a
Residue:152
BDBM50360825
NameBDBM50360825
Synonyms:CHEMBL1934803
TypeSmall organic molecule
Emp. Form.C18H15BrN4
Mol. Mass.367.242
SMILESCN(C)c1ccccc1-c1nc2c(cnc3cc(Br)ccc23)[nH]1