Reaction Details
TargetProstaglandin E synthase
LigandBDBM50360827
Substrate/Competitorn/a
Meas. Tech.ChEMBL_796762 (CHEMBL1938077)
IC50 330±n/a nM
Citation Shiro, TTakahashi, HKakiguchi, KInoue, YMasuda, KNagata, HTobe, M Synthesis and SAR study of imidazoquinolines as a novel structural class of microsomal prostaglandin E2 synthase-1 inhibitors. Bioorg Med Chem Lett22:285-8 (2011) 
 
Prostaglandin E synthase
Name:Prostaglandin E synthase
Type:Protein
Mol. Mass.:17112.22
Organism:Homo sapiens (Human)
Description:n/a
Residue:152
BDBM50360827
NameBDBM50360827
Synonyms:CHEMBL1934805
TypeSmall organic molecule
Emp. Form.C22H13BrClN3O
Mol. Mass.450.715
SMILESClc1ccccc1-c1nc2c([nH]1)c(Oc1ccccc1)nc1cc(Br)ccc21