Reaction Details
TargetHistamine H3 receptor
LigandBDBM50360897
Substrate/Competitorn/a
Meas. Tech.ChEMBL_795469 (CHEMBL1937474)
Ki 25±n/a nM
Citation Hudkins, RLAimone, LDDandu, RRDunn, DGruner, JAHuang, ZJosef, KALyons, JAMathiasen, JRTao, MZulli, ALRaddatz, R 4,5-dihydropyridazin-3-one derivatives as histamine H3 receptor inverse agonists. Bioorg Med Chem Lett22:194-8 (2011) 
 
Histamine H3 receptor
Name:Histamine H3 receptor
Type:G Protein-Coupled Receptor (GPCR)
Mol. Mass.:48607.98
Organism:Rattus norvegicus (rat)
Description:n/a
Residue:445
BDBM50360897
NameBDBM50360897
Synonyms:CHEMBL1935108
TypeSmall organic molecule
Emp. Form.C25H31N3O2
Mol. Mass.405.5325
SMILESC[C@@H]1CCCN1CCCOc1ccc(cc1)C1=NN(Cc2ccccc2)C(=O)CC1