Reaction Details
Target5-hydroxytryptamine receptor 6
LigandBDBM50361054
Substrate/Competitorn/a
Meas. Tech.ChEMBL_796060 (CHEMBL1936930)
Ki 22.3±n/a nM
Citation Sundar, BGBailey, TRDunn, DDBacon, ERSalvino, JMMorton, GCAimone, LDZeqi, HMathiasen, JRDicamillo, AHuffman, MJMcKenna, BAKopec, KLu, LDBrown, RQian, JAngeles, TConnors, TSpais, CHolskin, BGalinis, DDuzic, ESchaffhauser, HRosse, GC Novel brain penetrant benzofuropiperidine 5-HT6 receptor antagonists. Bioorg Med Chem Lett22:120-3 (2011) 
 
5-hydroxytryptamine receptor 6
Name:5-hydroxytryptamine receptor 6
Type:G Protein-Coupled Receptor (GPCR)
Mol. Mass.:46968.43
Organism:Homo sapiens (Human)
Description:P50406
Residue:440
BDBM50361054
NameBDBM50361054
Synonyms:CHEMBL1935600
TypeSmall organic molecule
Emp. Form.C20H18FNO4S
Mol. Mass.387.425
SMILESFc1cccc(c1)S(=O)(=O)c1ccc2c3CCNC4(CCOC4)c3oc2c1