Reaction Details
TargetNatural resistance-associated macrophage protein 2
LigandBDBM50361134
Substrate/Competitorn/a
Meas. Tech.ChEMBL_795244 (CHEMBL1936903)
IC50 60±n/a nM
Citation Cadieux, JAZhang, ZMattice, MBrownlie-Cutts, AFu, JRatkay, LGKwan, RThompson, JSanghara, JZhong, JGoldberg, YP Synthesis and biological evaluation of substituted pyrazoles as blockers of divalent metal transporter 1 (DMT1). Bioorg Med Chem Lett22:90-5 (2011) 
 
Natural resistance-associated macrophage protein 2
Name:Natural resistance-associated macrophage protein 2
Type:PROTEIN
Mol. Mass.:62262.02
Organism:Homo sapiens (Human)
Description:ChEMBL_795244
Residue:568
BDBM50361134
NameBDBM50361134
Synonyms:CHEMBL1933609
TypeSmall organic molecule
Emp. Form.C15H12N4O3
Mol. Mass.296.2808
SMILESCc1[nH]n(-c2ccccn2)c(=O)c1-c1ccc(cc1)[N+]([O-])=O