Reaction Details
TargetCyclin-dependent kinase 1
LigandBDBM50361196
Substrate/Competitorn/a
Meas. Tech.ChEMBL_794708 (CHEMBL1937317)
IC50 10000±n/a nM
Citation Yu, BTang, LDLi, YLSong, SHJi, XLLin, MSWu, CF Design, synthesis and antitumor activity of 4-aminoquinazoline derivatives targeting VEGFR-2 tyrosine kinase. Bioorg Med Chem Lett22:110-4 (2011) 
 
Cyclin-dependent kinase 1
Name:Cyclin-dependent kinase 1
Type:Enzyme Subunit
Mol. Mass.:34101.08
Organism:Homo sapiens (Human)
Description:P06493
Residue:297
BDBM50361196
NameBDBM50361196
Synonyms:CHEMBL1934327
TypeSmall organic molecule
Emp. Form.C28H29FN6O2
Mol. Mass.500.5673
SMILESCN1CCC(COc2ccc3c(Nc4ccc(NC(=O)Nc5cccc(F)c5)cc4)ncnc3c2)CC1