Reaction Details
TargetVascular endothelial growth factor receptor 2
LigandBDBM50361198
Substrate/Competitorn/a
Meas. Tech.ChEMBL_794697 (CHEMBL1937306)
IC50 45±n/a nM
Citation Yu, BTang, LDLi, YLSong, SHJi, XLLin, MSWu, CF Design, synthesis and antitumor activity of 4-aminoquinazoline derivatives targeting VEGFR-2 tyrosine kinase. Bioorg Med Chem Lett22:110-4 (2011) 
 
Vascular endothelial growth factor receptor 2
Name:Vascular endothelial growth factor receptor 2
Type:Receptor Tyrosine Kinase
Mol. Mass.:151510.97
Organism:Homo sapiens (Human)
Description:P35968
Residue:1356
BDBM50361198
NameBDBM50361198
Synonyms:CHEMBL1934329
TypeSmall organic molecule
Emp. Form.C29H31BrN6O2
Mol. Mass.575.499
SMILESCN1CCC(COc2ccc3c(Nc4ccc(NC(=O)Nc5ccc(C)c(Br)c5)cc4)ncnc3c2)CC1