Reaction Details
TargetMitogen-activated protein kinase 14
LigandBDBM50361468
Substrate/Competitorn/a
Meas. Tech.ChEMBL_797121 (CHEMBL1944479)
Kd 0.400000±n/a nM
Citation Millan, DSBunnage, MEBurrows, JLButcher, KJDodd, PGEvans, TJFairman, DAHughes, SJKilty, ICLemaitre, ALewthwaite, RAMahnke, AMathias, JPPhilip, JSmith, RTStefaniak, MHYeadon, MPhillips, C Design and synthesis of inhaled p38 inhibitors for the treatment of chronic obstructive pulmonary disease. J Med Chem54:7797-814 (2011) 
 
Mitogen-activated protein kinase 14
Name:Mitogen-activated protein kinase 14
Type:Serine/threonine-protein kinase
Mol. Mass.:41286.76
Organism:Homo sapiens (Human)
Description:Q16539
Residue:360
BDBM50361468
NameBDBM50361468
Synonyms:CHEMBL1938736
TypeSmall organic molecule
Emp. Form.C30H33N7OS
Mol. Mass.539.694
SMILESCC(C)c1nnc2ccc(Sc3ccccc3CNC(=O)Nc3cc(nn3-c3ccccc3)C(C)(C)C)cn12