Reaction Details
TargetLysine-specific histone demethylase 2
LigandBDBM50346864
Substrate/Competitorn/a
Meas. Tech.ChEMBL_797218 (CHEMBL1942533)
Ki 38000±n/a nM
Citation Suzuki, TMiyata, N Lysine demethylases inhibitors. J Med Chem54:8236-50 (2011) 
 
Lysine-specific histone demethylase 2
Name:Lysine-specific histone demethylase 2
Type:PROTEIN
Mol. Mass.:92112.91
Organism:Homo sapiens (Human)
Description:ChEMBL_992590
Residue:822
BDBM50346864
NameBDBM50346864
Synonyms:CHEMBL1797641 US8765820, 8
TypeSmall organic molecule
Emp. Form.C26H27N3O3
Mol. Mass.429.5109
SMILESNC1CC1c1ccc(NC(=O)C(Cc2ccccc2)NC(=O)OCc2ccccc2)cc1