Reaction Details
TargetProstaglandin G/H synthase 2
LigandBDBM50361592
Substrate/Competitorn/a
Meas. Tech.ChEMBL_799066 (CHEMBL1941925)
IC50 23±n/a nM
Citation Biava, MPorretta, GCPoce, GBattilocchio, CAlfonso, SRovini, MValenti, SGiorgi, GCalderone, VMartelli, ATestai, LSautebin, LRossi, APapa, GGhelardini, CDi Cesare Mannelli, LGiordani, AAnzellotti, PBruno, APatrignani, PAnzini, M Novel analgesic/anti-inflammatory agents: diarylpyrrole acetic esters endowed with nitric oxide releasing properties. J Med Chem54:7759-71 (2011) 
 
Prostaglandin G/H synthase 2
Name:Prostaglandin G/H synthase 2
Type:Protein
Mol. Mass.:69020.39
Organism:Mus musculus (Mouse)
Description:Q05769
Residue:604
BDBM50361592
NameBDBM50361592
Synonyms:CHEMBL1939511 | US9162979, 8-II
TypeSmall organic molecule
Emp. Form.C23H24FNO5S
Mol. Mass.445.504
SMILESCc1c(CC(=O)OCCCO)cc(-c2ccc(cc2)S(C)(=O)=O)n1-c1cccc(F)c1