Reaction Details
TargetMatrix metalloproteinase-16
LigandBDBM50361600
Substrate/Competitorn/a
Meas. Tech.ChEMBL_799129 (CHEMBL1942113)
IC50 2200±n/a nM
Citation Marques, SMTuccinardi, TNuti, ESantamaria, SAndré, VRossello, AMartinelli, ASantos, MA Novel 1-hydroxypiperazine-2,6-diones as new leads in the inhibition of metalloproteinases. J Med Chem54:8289-98 (2011) 
 
Matrix metalloproteinase-16
Name:Matrix metalloproteinase-16
Type:PROTEIN
Mol. Mass.:69536.76
Organism:Homo sapiens (Human)
Description:ChEMBL_799129
Residue:607
BDBM50361600
NameBDBM50361600
Synonyms:CHEMBL1939845
TypeSmall organic molecule
Emp. Form.C19H20N2O5S
Mol. Mass.388.438
SMILESCC(C)[C@H]1N(CC(=O)N(O)C1=O)S(=O)(=O)c1ccc(cc1)-c1ccccc1