Reaction Details
TargetHeat shock protein HSP 90-beta
LigandBDBM50361675
Substrate/Competitorn/a
Meas. Tech.ChEMBL_798935 (CHEMBL1943442)
IC50 37±n/a nM
Citation Baruchello, RSimoni, DGrisolia, GBarbato, GMarchetti, PRondanin, RMangiola, SGiannini, GBrunetti, TAlloatti, DGallo, GCiacci, AVesci, LCastorina, MMilazzo, FMCervoni, MLGuglielmi, MBBarbarino, MFoderà, RPisano, CCabri, W Novel 3,4-isoxazolediamides as potent inhibitors of chaperone heat shock protein 90. J Med Chem54:8592-604 (2011) 
 
Heat shock protein HSP 90-beta
Name:Heat shock protein HSP 90-beta
Type:Molecular Chaperone
Mol. Mass.:83229.45
Organism:Homo sapiens (Human)
Description:P08238
Residue:724
BDBM50361675
NameBDBM50361675
Synonyms:CHEMBL1940918
TypeSmall organic molecule
Emp. Form.C14H14ClN3O5
Mol. Mass.339.731
SMILESCCNC(=O)c1noc(c1NC(C)=O)-c1cc(Cl)c(O)cc1O