Reaction Details
TargetHeat shock protein HSP 90-beta
LigandBDBM50361717
Substrate/Competitorn/a
Meas. Tech.ChEMBL_798935 (CHEMBL1943442)
IC50 27±n/a nM
Citation Baruchello, RSimoni, DGrisolia, GBarbato, GMarchetti, PRondanin, RMangiola, SGiannini, GBrunetti, TAlloatti, DGallo, GCiacci, AVesci, LCastorina, MMilazzo, FMCervoni, MLGuglielmi, MBBarbarino, MFoderà, RPisano, CCabri, W Novel 3,4-isoxazolediamides as potent inhibitors of chaperone heat shock protein 90. J Med Chem54:8592-604 (2011) 
 
Heat shock protein HSP 90-beta
Name:Heat shock protein HSP 90-beta
Type:Molecular Chaperone
Mol. Mass.:83229.45
Organism:Homo sapiens (Human)
Description:P08238
Residue:724
BDBM50361717
NameBDBM50361717
Synonyms:CHEMBL1941066
TypeSmall organic molecule
Emp. Form.C25H25N5O5S
Mol. Mass.507.562
SMILESCCNC(=O)c1noc(c1NC(=O)c1sc(nc1C)-c1ccncc1)-c1cc(C(C)C)c(O)cc1O