Reaction Details
TargetCarbonic anhydrase 9
LigandBDBM12342
Substrate/Competitorn/a
Meas. Tech.ChEMBL_799273 (CHEMBL1941823)
Ki>500000±n/a nM
Citation Touisni, NMaresca, AMcDonald, PCLou, YScozzafava, ADedhar, SWinum, JYSupuran, CT Glycosyl coumarin carbonic anhydrase IX and XII inhibitors strongly attenuate the growth of primary breast tumors. J Med Chem54:8271-7 (2011) 
 
Carbonic anhydrase 9
Name:Carbonic anhydrase 9
Type:Enzyme
Mol. Mass.:49669.03
Organism:Homo sapiens (Human)
Description:Catalytic domain of human cloned isozyme was used in the assay
Residue:459
BDBM12342
NameBDBM12342
Synonyms:2H-chromen-2-one Coumarin
TypeNatural product
Emp. Form.C9H6O2
Mol. Mass.146.1427
SMILESO=c1ccc2ccccc2o1