Reaction Details
TargetCarbonic anhydrase 12
LigandBDBM50361734
Substrate/Competitorn/a
Meas. Tech.ChEMBL_799274 (CHEMBL1941824)
Ki 105±n/a nM
Citation Touisni, NMaresca, AMcDonald, PCLou, YScozzafava, ADedhar, SWinum, JYSupuran, CT Glycosyl coumarin carbonic anhydrase IX and XII inhibitors strongly attenuate the growth of primary breast tumors. J Med Chem54:8271-7 (2011) 
 
Carbonic anhydrase 12
Name:Carbonic anhydrase 12
Type:Enzyme
Mol. Mass.:39456.00
Organism:Homo sapiens (Human)
Description:Catalytic domain of human cloned isozyme was used in the assay
Residue:354
BDBM50361734
NameBDBM50361734
Synonyms:CHEMBL1938471
TypeSmall organic molecule
Emp. Form.C15H16O7
Mol. Mass.308.2833
SMILESCc1cc(=O)oc2cc(O[C@@H]3OC[C@@H](O)[C@H](O)[C@H]3O)ccc12