Reaction Details
TargetCarbonic anhydrase 1
LigandBDBM50022178
Substrate/Competitorn/a
Meas. Tech.ChEMBL_799271 (CHEMBL1941821)
Ki>100000±n/a nM
Citation Touisni, NMaresca, AMcDonald, PCLou, YScozzafava, ADedhar, SWinum, JYSupuran, CT Glycosyl coumarin carbonic anhydrase IX and XII inhibitors strongly attenuate the growth of primary breast tumors. J Med Chem54:8271-7 (2011) 
 
Carbonic anhydrase 1
Name:Carbonic anhydrase 1
Type:Enzyme
Mol. Mass.:28873.37
Organism:Homo sapiens (Human)
Description:P00915
Residue:261
BDBM50022178
NameBDBM50022178
Synonyms:4-Methyl-7-hydroxycoumarin 7-Hydroxy-4-methyl-2-oxo-2H-1-benzopyran 7-Hydroxy-4-methyl-2H-1-benzopyran-2-one 7-Hydroxy-4-methylcoumarin CHEMBL12208 Imecromone cid_5280567
TypeSmall organic molecule
Emp. Form.C10H8O3
Mol. Mass.176.1687
SMILESCc1cc(=O)oc2cc(O)ccc12