Reaction Details
TargetCarbonic anhydrase 2
LigandBDBM50361735
Substrate/Competitorn/a
Meas. Tech.ChEMBL_799272 (CHEMBL1941822)
Ki 590±n/a nM
Citation Touisni, NMaresca, AMcDonald, PCLou, YScozzafava, ADedhar, SWinum, JYSupuran, CT Glycosyl coumarin carbonic anhydrase IX and XII inhibitors strongly attenuate the growth of primary breast tumors. J Med Chem54:8271-7 (2011) 
 
Carbonic anhydrase 2
Name:Carbonic anhydrase 2
Type:Enzyme
Mol. Mass.:29250.71
Organism:Homo sapiens (Human)
Description:P00918
Residue:260
BDBM50361735
NameBDBM50361735
Synonyms:CHEMBL1938472
TypeSmall organic molecule
Emp. Form.C22H28O13
Mol. Mass.500.4499
SMILESCc1cc(=O)oc2cc(O[C@@H]3O[C@H](CO[C@H]4O[C@H](CO)[C@H](O)[C@H](O)[C@H]4O)[C@@H](O)[C@H](O)[C@H]3O)ccc12