Reaction Details
TargetGlutathione S-transferase A2
LigandBDBM50361796
Substrate/Competitorn/a
Meas. Tech.ChEMBL_799590 (CHEMBL1941296)
IC50 178600±n/a nM
Citation Wang, CHWu, HTCheng, HMYen, TJLu, IHChang, HCJao, SCShing, TKLi, WS Inhibition of glutathione S-transferase M1 by new gabosine analogues is essential for overcoming cisplatin resistance in lung cancer cells. J Med Chem54:8574-81 (2011) 
 
Glutathione S-transferase A2
Name:Glutathione S-transferase A2
Type:PROTEIN
Mol. Mass.:25667.17
Organism:Homo sapiens (Human)
Description:ChEMBL_799590
Residue:222
BDBM50361796
NameBDBM50361796
Synonyms:CHEMBL1938637
TypeSmall organic molecule
Emp. Form.C25H38O8
Mol. Mass.466.5644
SMILES[#6]-[#8][C@]1([#6])[#8]-[#6@H]-2-[#6@@H](-[#8]-[#6]\[#6]=[#6](/[#6])-[#6]-[#6]\[#6]=[#6](\[#6])-[#6])-[#6]=[#6](-[#6]-[#8]-[#6](-[#6])=O)-[#6](=O)-[#6@@H]-2-[#8][C@@]1([#6])[#8]-[#6]