Reaction Details
TargetGlutathione S-transferase Mu 1
LigandBDBM50361794
Substrate/Competitorn/a
Meas. Tech.ChEMBL_799591 (CHEMBL1941297)
IC50 162700±n/a nM
Citation Wang, CHWu, HTCheng, HMYen, TJLu, IHChang, HCJao, SCShing, TKLi, WS Inhibition of glutathione S-transferase M1 by new gabosine analogues is essential for overcoming cisplatin resistance in lung cancer cells. J Med Chem54:8574-81 (2011) 
 
Glutathione S-transferase Mu 1
Name:Glutathione S-transferase Mu 1
Type:PROTEIN
Mol. Mass.:25712.03
Organism:Homo sapiens (Human)
Description:ChEMBL_799596
Residue:218
BDBM50361794
NameBDBM50361794
Synonyms:CHEMBL1938635
TypeSmall organic molecule
Emp. Form.C20H30O8
Mol. Mass.398.4474
SMILES[#6]-[#8][C@]1([#6])[#8]-[#6@H]-2-[#6@@H](-[#8]-[#6]\[#6]=[#6](\[#6])-[#6])-[#6]=[#6](-[#6]-[#8]-[#6](-[#6])=O)-[#6](=O)-[#6@@H]-2-[#8][C@@]1([#6])[#8]-[#6]