Reaction Details
TargetGlutathione S-transferase A2
LigandBDBM50361809
Substrate/Competitorn/a
Meas. Tech.ChEMBL_799590 (CHEMBL1941296)
IC50>100000±n/a nM
Citation Wang, CHWu, HTCheng, HMYen, TJLu, IHChang, HCJao, SCShing, TKLi, WS Inhibition of glutathione S-transferase M1 by new gabosine analogues is essential for overcoming cisplatin resistance in lung cancer cells. J Med Chem54:8574-81 (2011) 
 
Glutathione S-transferase A2
Name:Glutathione S-transferase A2
Type:PROTEIN
Mol. Mass.:25667.17
Organism:Homo sapiens (Human)
Description:ChEMBL_799590
Residue:222
BDBM50361809
NameBDBM50361809
Synonyms:CHEMBL1938627
TypeSmall organic molecule
Emp. Form.C16H24O8
Mol. Mass.344.357
SMILESCO[C@@H]1C=C(COC(C)=O)C(=O)[C@@H]2O[C@@](C)(OC)[C@](C)(OC)O[C@@H]12