Reaction Details
TargetSphingosine 1-phosphate receptor 1
LigandBDBM50158348
Substrate/Competitorn/a
Meas. Tech.ChEMBL_799851 (CHEMBL1941557)
EC50 18±n/a nM
Citation Pennington, LDCroghan, MDSham, KKPickrell, AJHarrington, PEFrohn, MJLanman, BAReed, ABLee, MRXu, HMcElvain, MXu, YZhang, XFiorino, MHorner, MMorrison, HGArnett, HAFotsch, CTasker, ASWong, MCee, VJ Quinolinone-based agonists of S1P¿?: use of a N-scan SAR strategy to optimize in vitro and in vivo activity. Bioorg Med Chem Lett22:527-31 (2011) 
 
Sphingosine 1-phosphate receptor 1
Name:Sphingosine 1-phosphate receptor 1
Type:Enzyme
Mol. Mass.:42836.02
Organism:Homo sapiens (Human)
Description:P21453
Residue:382
BDBM50158348
NameBDBM50158348
Synonyms:(2S,3R,4E)-2-amino-3-hydroxyoctadec-4-en-1-yl dihydrogen phosphate CHEMBL225155 US11584726, Example S1P sphingosine-1-phosphate
TypeSmall organic molecule
Emp. Form.C18H38NO5P
Mol. Mass.379.4718
SMILESCCCCCCCCCCCCC\C=C\[C@@H](O)[C@@H](N)COP(O)(O)=O