Reaction Details
TargetMet repressor
LigandBDBM50362008
Substrate/Competitorn/a
Meas. Tech.ChEMBL_799628 (CHEMBL1941334)
EC50 10±n/a nM
Citation Joce, CWhite, RStockley, PGWarriner, STurnbull, WBNelson, A Design, synthesis and in vitro evaluation of novel bivalent S-adenosylmethionine analogues. Bioorg Med Chem Lett22:278-84 (2011) 
 
Met repressor
Name:Met repressor
Synonyms:Met regulon regulatory protein MetJ
Type:PROTEIN
Mol. Mass.:12138.09
Organism:Escherichia coli
Description:ChEMBL_799627
Residue:105
BDBM50362008
NameBDBM50362008
Synonyms:CHEMBL1939716
TypeSmall organic molecule
Emp. Form.C40H60N16O8
Mol. Mass.893.0057
SMILESC[N+](C)(CC[C@H](N)C(=O)NCc1cccc(CNC(=O)[C@@H](N)CC[N+](C)(C)C[C@H]2O[C@H]([C@H](O)[C@@H]2O)n2cnc3c(N)ncnc23)c1)C[C@H]1O[C@H]([C@H](O)[C@@H]1O)n1cnc2c(N)ncnc12