Reaction Details
TargetMet repressor
LigandBDBM50362016
Substrate/Competitorn/a
Meas. Tech.ChEMBL_799628 (CHEMBL1941334)
EC50 150±n/a nM
Citation Joce, CWhite, RStockley, PGWarriner, STurnbull, WBNelson, A Design, synthesis and in vitro evaluation of novel bivalent S-adenosylmethionine analogues. Bioorg Med Chem Lett22:278-84 (2011) 
 
Met repressor
Name:Met repressor
Synonyms:Met regulon regulatory protein MetJ
Type:PROTEIN
Mol. Mass.:12138.09
Organism:Escherichia coli
Description:ChEMBL_799627
Residue:105
BDBM50362016
NameBDBM50362016
Synonyms:CHEMBL1939724
TypeSmall organic molecule
Emp. Form.C19H32N7O4
Mol. Mass.422.5013
SMILESCCCNC(=O)CCC[N+](C)(C)C[C@H]1O[C@H]([C@H](O)[C@@H]1O)n1cnc2c(N)ncnc12