Reaction Details
TargetcAMP and cAMP-inhibited cGMP 3',5'-cyclic phosphodiesterase 10A
LigandBDBM50362029
Substrate/Competitorn/a
Meas. Tech.ChEMBL_797299 (CHEMBL1942791)
Ki 202±n/a nM
Citation Yang, SWSmotryski, JMcElroy, WTTan, ZHo, GTulshian, DGreenlee, WJGuzzi, MZhang, XMullins, DXiao, LHruza, AChan, TMRindgen, DBleickardt, CHodgson, R Discovery of orally active pyrazoloquinolines as potent PDE10 inhibitors for the management of schizophrenia. Bioorg Med Chem Lett22:235-9 (2011) 
 
cAMP and cAMP-inhibited cGMP 3',5'-cyclic phosphodiesterase 10A
Name:cAMP and cAMP-inhibited cGMP 3',5'-cyclic phosphodiesterase 10A
Type:Protein
Mol. Mass.:88412.52
Organism:Homo sapiens (Human)
Description:Q9Y233
Residue:1055
BDBM50362029
NameBDBM50362029
Synonyms:CHEMBL1939908
TypeSmall organic molecule
Emp. Form.C19H23FN4O
Mol. Mass.342.4105
SMILESCOc1cc(C)c2nc3[nH]nc(C)c3c(CN3CCC(F)CC3)c2c1