Reaction Details
TargetcAMP and cAMP-inhibited cGMP 3',5'-cyclic phosphodiesterase 10A
LigandBDBM50362035
Substrate/Competitorn/a
Meas. Tech.ChEMBL_797299 (CHEMBL1942791)
Ki 1±n/a nM
Citation Yang, SWSmotryski, JMcElroy, WTTan, ZHo, GTulshian, DGreenlee, WJGuzzi, MZhang, XMullins, DXiao, LHruza, AChan, TMRindgen, DBleickardt, CHodgson, R Discovery of orally active pyrazoloquinolines as potent PDE10 inhibitors for the management of schizophrenia. Bioorg Med Chem Lett22:235-9 (2011) 
 
cAMP and cAMP-inhibited cGMP 3',5'-cyclic phosphodiesterase 10A
Name:cAMP and cAMP-inhibited cGMP 3',5'-cyclic phosphodiesterase 10A
Type:Protein
Mol. Mass.:88412.52
Organism:Homo sapiens (Human)
Description:Q9Y233
Residue:1055
BDBM50362035
NameBDBM50362035
Synonyms:CHEMBL1939914
TypeSmall organic molecule
Emp. Form.C18H22N4O2
Mol. Mass.326.3929
SMILESCOc1cc(C)c2nc3[nH]nc(C)c3c(CN3CCOCC3)c2c1