Reaction Details
TargetMitogen-activated protein kinase 14
LigandBDBM50362101
Substrate/Competitorn/a
Meas. Tech.ChEMBL_797419 (CHEMBL1943082)
Kd 14700±n/a nM
Citation Getlik, MGrütter, CSimard, JRNguyen, HDRobubi, AAust, Bvan Otterlo, WARauh, D Structure-based design, synthesis and biological evaluation of N-pyrazole, N'-thiazole urea inhibitors of MAP kinase p38a. Eur J Med Chem48:1-15 (2012) 
 
Mitogen-activated protein kinase 14
Name:Mitogen-activated protein kinase 14
Type:Serine/threonine-protein kinase
Mol. Mass.:41286.76
Organism:Homo sapiens (Human)
Description:Q16539
Residue:360
BDBM50362101
NameBDBM50362101
Synonyms:CHEMBL1940502
TypeSmall organic molecule
Emp. Form.C27H27N5O4S
Mol. Mass.517.599
SMILESOC(=O)Cc1cccc(c1)-n1nc(cc1NC(=O)Nc1nc(CCOCc2ccccc2)cs1)C1CC1