Reaction Details
TargetInduced myeloid leukemia cell differentiation protein Mcl-1
LigandBDBM50362152
Substrate/Competitorn/a
Meas. Tech.ChEMBL_797477 (CHEMBL1943220)
Ki 2540±n/a nM
Citation Zheng, CHYang, HZhang, MLu, SHShi, DWang, JChen, XHRen, XHLiu, JLv, JGZhu, JZhou, YJ Design, synthesis, and activity evaluation of broad-spectrum small-molecule inhibitors of anti-apoptotic Bcl-2 family proteins: characteristics of broad-spectrum protein binding and its effects on anti-tumor activity. Bioorg Med Chem Lett22:39-44 (2011) 
 
Induced myeloid leukemia cell differentiation protein Mcl-1
Name:Induced myeloid leukemia cell differentiation protein Mcl-1
Type:Membrane; Single-pass membrane protein
Mol. Mass.:37332.87
Organism:Homo sapiens (Human)
Description:Q07820
Residue:350
BDBM50362152
NameBDBM50362152
Synonyms:CHEMBL1940671
TypeSmall organic molecule
Emp. Form.C28H23FN4O6S2
Mol. Mass.594.634
SMILES[O-][N+](=O)c1cc(ccc1NCCSc1ccccc1)S(=O)(=O)NC(=O)c1ccc(NC(=O)c2ccc(F)cc2)cc1