Reaction Details
TargetProstaglandin D2 receptor 2
LigandBDBM50362166
Substrate/Competitorn/a
Meas. Tech.ChEMBL_797666 (CHEMBL1943886)
IC50 9.7±n/a nM
Citation Ito, STerasaka, TZenkoh, TMatsuda, HHayashida, HNagata, HImamura, YKobayashi, MTakeuchi, MOhta, M Discovery of novel and potent CRTH2 antagonists. Bioorg Med Chem Lett22:1194-7 (2012) 
 
Prostaglandin D2 receptor 2
Name:Prostaglandin D2 receptor 2
Type:Enzyme
Mol. Mass.:43295.45
Organism:Homo sapiens (Human)
Description:Q9Y5Y4
Residue:395
BDBM50362166
NameBDBM50362166
Synonyms:CHEMBL1941128
TypeSmall organic molecule
Emp. Form.C33H33NO4
Mol. Mass.507.6194
SMILESOC(=O)COc1cccc(CCCN(CCC(c2ccccc2)c2ccccc2)C(=O)c2ccccc2)c1