Reaction Details
TargetProstaglandin D2 receptor 2
LigandBDBM50362164
Substrate/Competitorn/a
Meas. Tech.ChEMBL_797666 (CHEMBL1943886)
IC50 11±n/a nM
Citation Ito, STerasaka, TZenkoh, TMatsuda, HHayashida, HNagata, HImamura, YKobayashi, MTakeuchi, MOhta, M Discovery of novel and potent CRTH2 antagonists. Bioorg Med Chem Lett22:1194-7 (2012) 
 
Prostaglandin D2 receptor 2
Name:Prostaglandin D2 receptor 2
Type:Enzyme
Mol. Mass.:43295.45
Organism:Homo sapiens (Human)
Description:Q9Y5Y4
Residue:395
BDBM50362164
NameBDBM50362164
Synonyms:CHEMBL1941126
TypeSmall organic molecule
Emp. Form.C31H31NO4
Mol. Mass.481.5821
SMILESOC(=O)CCCOc1cccc(CCCn2cc(ccc2=O)C(c2ccccc2)c2ccccc2)c1