Reaction Details
TargetProstaglandin D2 receptor 2
LigandBDBM50362157
Substrate/Competitorn/a
Meas. Tech.ChEMBL_797760 (CHEMBL1944119)
IC50 359±n/a nM
Citation Ito, STerasaka, TZenkoh, TMatsuda, HHayashida, HNagata, HImamura, YKobayashi, MTakeuchi, MOhta, M Discovery of novel and potent CRTH2 antagonists. Bioorg Med Chem Lett22:1194-7 (2012) 
 
Prostaglandin D2 receptor 2
Name:Prostaglandin D2 receptor 2
Synonyms:Chemoattractant receptor-homologous molecule expressed on Th2 cells
Type:PROTEIN
Mol. Mass.:42241.65
Organism:Cavia porcellus
Description:ChEMBL_797760
Residue:391
BDBM50362157
NameBDBM50362157
Synonyms:CHEMBL1941118
TypeSmall organic molecule
Emp. Form.C29H25F2NO4
Mol. Mass.489.5099
SMILESOC(=O)COc1cccc(CCCn2cc(ccc2=O)C(c2ccc(F)cc2)c2ccc(F)cc2)c1