Reaction Details
TargetProstaglandin D2 receptor 2
LigandBDBM50362168
Substrate/Competitorn/a
Meas. Tech.ChEMBL_797760 (CHEMBL1944119)
IC50>1000±n/a nM
Citation Ito, STerasaka, TZenkoh, TMatsuda, HHayashida, HNagata, HImamura, YKobayashi, MTakeuchi, MOhta, M Discovery of novel and potent CRTH2 antagonists. Bioorg Med Chem Lett22:1194-7 (2012) 
 
Prostaglandin D2 receptor 2
Name:Prostaglandin D2 receptor 2
Synonyms:Chemoattractant receptor-homologous molecule expressed on Th2 cells
Type:PROTEIN
Mol. Mass.:42241.65
Organism:Cavia porcellus
Description:ChEMBL_797760
Residue:391
BDBM50362168
NameBDBM50362168
Synonyms:CHEMBL1941125
TypeSmall organic molecule
Emp. Form.C31H31NO4
Mol. Mass.481.5821
SMILESCC(C)(Oc1cccc(CCCn2cc(ccc2=O)C(c2ccccc2)c2ccccc2)c1)C(O)=O