Reaction Details
TargetProstaglandin D2 receptor 2
LigandBDBM50362166
Substrate/Competitorn/a
Meas. Tech.ChEMBL_797760 (CHEMBL1944119)
IC50 18±n/a nM
Citation Ito, STerasaka, TZenkoh, TMatsuda, HHayashida, HNagata, HImamura, YKobayashi, MTakeuchi, MOhta, M Discovery of novel and potent CRTH2 antagonists. Bioorg Med Chem Lett22:1194-7 (2012) 
 
Prostaglandin D2 receptor 2
Name:Prostaglandin D2 receptor 2
Synonyms:Chemoattractant receptor-homologous molecule expressed on Th2 cells
Type:PROTEIN
Mol. Mass.:42241.65
Organism:Cavia porcellus
Description:ChEMBL_797760
Residue:391
BDBM50362166
NameBDBM50362166
Synonyms:CHEMBL1941128
TypeSmall organic molecule
Emp. Form.C33H33NO4
Mol. Mass.507.6194
SMILESOC(=O)COc1cccc(CCCN(CCC(c2ccccc2)c2ccccc2)C(=O)c2ccccc2)c1