Reaction Details
TargetMAP kinase-activated protein kinase 2
LigandBDBM50362173
Substrate/Competitorn/a
Meas. Tech.ChEMBL_797937 (CHEMBL1942718)
IC50 2.9±n/a nM
Citation Rao, AUXiao, DHuang, XZhou, WFossetta, JLundell, DTian, FTrivedi, PAslanian, RPalani, A Facile synthesis of tetracyclic azepine and oxazocine derivatives and their potential as MAPKAP-K2 (MK2) inhibitors. Bioorg Med Chem Lett22:1068-72 (2012) 
 
MAP kinase-activated protein kinase 2
Name:MAP kinase-activated protein kinase 2
Type:Serine/threonine-protein kinase
Mol. Mass.:45579.87
Organism:Homo sapiens (Human)
Description:P49137
Residue:400
BDBM50362173
NameBDBM50362173
Synonyms:CHEMBL1938685
TypeSmall organic molecule
Emp. Form.C25H21N5O
Mol. Mass.407.4671
SMILESN#Cc1ccc(cc1)-c1cc2Cc3cc(ccc3-n3ccnc3-c2o1)N1CCNCC1