Reaction Details
TargetMAP kinase-activated protein kinase 2
LigandBDBM50362169
Substrate/Competitorn/a
Meas. Tech.ChEMBL_797938 (CHEMBL1942719)
EC50 2000±n/a nM
Citation Rao, AUXiao, DHuang, XZhou, WFossetta, JLundell, DTian, FTrivedi, PAslanian, RPalani, A Facile synthesis of tetracyclic azepine and oxazocine derivatives and their potential as MAPKAP-K2 (MK2) inhibitors. Bioorg Med Chem Lett22:1068-72 (2012) 
 
MAP kinase-activated protein kinase 2
Name:MAP kinase-activated protein kinase 2
Type:Serine/threonine-protein kinase
Mol. Mass.:45579.87
Organism:Homo sapiens (Human)
Description:P49137
Residue:400
BDBM50362169
NameBDBM50362169
Synonyms:CHEMBL1938680
TypeSmall organic molecule
Emp. Form.C21H20ClN3O2
Mol. Mass.381.855
SMILESClc1ccc(cc1)-c1ccc(o1)C(=O)Nc1ccc(cc1)N1CCNCC1