Reaction Details
TargetDelta-type opioid receptor
LigandBDBM50362310
Substrate/Competitorn/a
Meas. Tech.ChEMBL_797688 (CHEMBL1943908)
IC50 1.1±n/a nM
Citation McCauley, JPDantzman, CLKing, MMErnst, GEWang, XBrush, KPalmer, WEFrietze, WAndisik, DWHoesch, VDoring, KHulsizer, JBui, KHLiu, JHudzik, TJWesolowski, SS Multiparameter exploration of piperazine derivatives asd-opioid receptor agonists for CNS indications. Bioorg Med Chem Lett22:1169-73 (2012) 
 
Delta-type opioid receptor
Name:Delta-type opioid receptor
Type:G Protein-Coupled Receptor (GPCR)
Mol. Mass.:40382.98
Organism:Homo sapiens (Human)
Description:Competition binding assays were carried out using membrane preparations from transfected HN9.10 cells that constitutively expressed the delta opioid receptor.
Residue:372
BDBM50362310
NameBDBM50362310
Synonyms:CHEMBL1939743
TypeSmall organic molecule
Emp. Form.C29H40N4O3
Mol. Mass.492.6529
SMILESCCN(CC)C(=O)c1ccc(cc1)[C@@H](N1CCN(CCOC)CC1)c1cccc(NC(=O)C2CC2)c1