Reaction Details
TargetDelta-type opioid receptor
LigandBDBM50362298
Substrate/Competitorn/a
Meas. Tech.ChEMBL_797688 (CHEMBL1943908)
IC50 4.1±n/a nM
Citation McCauley, JPDantzman, CLKing, MMErnst, GEWang, XBrush, KPalmer, WEFrietze, WAndisik, DWHoesch, VDoring, KHulsizer, JBui, KHLiu, JHudzik, TJWesolowski, SS Multiparameter exploration of piperazine derivatives asd-opioid receptor agonists for CNS indications. Bioorg Med Chem Lett22:1169-73 (2012) 
 
Delta-type opioid receptor
Name:Delta-type opioid receptor
Type:G Protein-Coupled Receptor (GPCR)
Mol. Mass.:40382.98
Organism:Homo sapiens (Human)
Description:Competition binding assays were carried out using membrane preparations from transfected HN9.10 cells that constitutively expressed the delta opioid receptor.
Residue:372
BDBM50362298
NameBDBM50362298
Synonyms:CHEMBL1939752
TypeSmall organic molecule
Emp. Form.C30H35N5O3
Mol. Mass.513.6306
SMILESCCOC(=O)Nc1cccc(c1)[C@H](N1CCN(Cc2cccnc2)CC1)c1ccc(cc1)C(=O)N1CCC1