Reaction Details
TargetCathepsin D
LigandBDBM50362536
Substrate/Competitorn/a
Meas. Tech.ChEMBL_797830 (CHEMBL1942416)
IC50 2000±n/a nM
Citation Saify, ZSAzim, MKAhmad, WNisa, MGoldberg, DEHussain, SAAkhtar, SAkram, AArayne, AOksman, AKhan, IA New benzimidazole derivatives as antiplasmodial agents and plasmepsin inhibitors: synthesis and analysis of structure-activity relationships. Bioorg Med Chem Lett22:1282-6 (2012) 
 
Cathepsin D
Name:Cathepsin D
Type:Enzyme
Mol. Mass.:44551.72
Organism:Homo sapiens (Human)
Description:Human proCathepsin D (SwissProt accession number P07339) was expressed in Sf9 cells, purified, and autoactivated.
Residue:412
BDBM50362536
NameBDBM50362536
Synonyms:CHEMBL1941013
TypeSmall organic molecule
Emp. Form.C26H19N3O
Mol. Mass.389.4486
SMILESO=C(Cn1c(nc2ccccc12)-c1ccccn1)c1ccc(cc1)-c1ccccc1