Reaction Details
TargetcAMP and cAMP-inhibited cGMP 3',5'-cyclic phosphodiesterase 10A
LigandBDBM50362719
Substrate/Competitorn/a
Meas. Tech.ChEMBL_797637 (CHEMBL1943755)
Ki 52±n/a nM
Citation Ho, GDYang, SWSmotryski, JBercovici, ANechuta, TSmith, EMMcElroy, WTan, ZTulshian, DMcKittrick, BGreenlee, WJHruza, AXiao, LRindgen, DMullins, DGuzzi, MZhang, XBleickardt, CHodgson, R The discovery of potent, selective, and orally active pyrazoloquinolines as PDE10A inhibitors for the treatment of Schizophrenia. Bioorg Med Chem Lett22:1019-22 (2012) 
 
cAMP and cAMP-inhibited cGMP 3',5'-cyclic phosphodiesterase 10A
Name:cAMP and cAMP-inhibited cGMP 3',5'-cyclic phosphodiesterase 10A
Type:Protein
Mol. Mass.:88412.52
Organism:Homo sapiens (Human)
Description:Q9Y233
Residue:1055
BDBM50362719
NameBDBM50362719
Synonyms:CHEMBL1939804
TypeSmall organic molecule
Emp. Form.C19H24N4O2
Mol. Mass.340.4195
SMILESCOc1cc(C)c2nc3[nH]nc(C)c3c(NCC3CCOCC3)c2c1