Reaction Details
TargetcAMP and cAMP-inhibited cGMP 3',5'-cyclic phosphodiesterase 10A
LigandBDBM50362728
Substrate/Competitorn/a
Meas. Tech.ChEMBL_797637 (CHEMBL1943755)
Ki 1±n/a nM
Citation Ho, GDYang, SWSmotryski, JBercovici, ANechuta, TSmith, EMMcElroy, WTan, ZTulshian, DMcKittrick, BGreenlee, WJHruza, AXiao, LRindgen, DMullins, DGuzzi, MZhang, XBleickardt, CHodgson, R The discovery of potent, selective, and orally active pyrazoloquinolines as PDE10A inhibitors for the treatment of Schizophrenia. Bioorg Med Chem Lett22:1019-22 (2012) 
 
cAMP and cAMP-inhibited cGMP 3',5'-cyclic phosphodiesterase 10A
Name:cAMP and cAMP-inhibited cGMP 3',5'-cyclic phosphodiesterase 10A
Type:Protein
Mol. Mass.:88412.52
Organism:Homo sapiens (Human)
Description:Q9Y233
Residue:1055
BDBM50362728
NameBDBM50362728
Synonyms:CHEMBL1939794
TypeSmall organic molecule
Emp. Form.C18H23N5O
Mol. Mass.325.4081
SMILESCOc1cc(C)c2nc3[nH]nc(C)c3c(N3CCC(N)CC3)c2c1